anonymous Log in
Search
Recents:
v3.0
sd
error al ejecutar emulador
24/11/20 21:25

martin gaston

Replies: 2

Hola,
Trabajo con Gx16 U11, java.
Me esta ocurriendo con frecuencia, que la pc que utilizo, tiene algun error
grave (tipo bluescreen) cuando estoy trabajando con el emulador y la pc se
reinicia.
Luego de reiniciar, tengo problemas para levantar el emulador (algo
asociado a un bloqueo), Me recomendaron eliminar el contenido de
"android\avd\GeneXus-API29-X86.avd"
Es sugerencia me funciono bien.
Hoy se volvio a reiniciar la pc, mismo problema, con lo cual aplique el
mismo fix.
Ahora el error cambio y obtengo lo siguiente.
> Task :FleetMobile:transformDexArchiveWithDexMergerForDebug FAILED
error:
error: FAILURE: Build failed with an exception.
error:
error: * What went wrong:
error: Execution failed for task
':FleetMobile:transformDexArchiveWithDexMergerForDebug'.
error: > java.lang.IllegalStateException: Expected BEGIN_ARRAY but was
STRING at line 1 column 1 path $
error:
error: * Try:
error: Run with --stacktrace option to get the stack trace. Run with --info
or --debug option to get more log output. Run with --scan to get full
insights.
error:
error: * Get more help at https://help.gradle.org
Deprecated Gradle features were used in this build, making it incompatible
with Gradle 6.0.
Use '--warning-mode all' to show the individual deprecation warnings.
See
https://docs.gradle.org/5.4.1/userguide/command_line_interface.html#sec:command_line_warnings
error:
error: BUILD FAILED in 40s
21 actionable tasks: 3 executed, 18 up-to-date
Failed: Android Compilation
Failed: Run FleetMobile
Levante el emulador desde el androi studio, levanta bien, pero al ejecutar
la aplicación (desde genexus) se produce el siguiente error:
adb: failed to install
D:\Models\FleetMobile_U11_k2b-12.4\JavaModel\mobile\Android\FleetMobile\build\outputs\apk\debug\FleetMobile-debug.apk:
Failure [INSTALL_PARSE_FAILED_NOT_APK: Failed to parse
/data/app/vmdl1995792822.tmp/base.apk]
Alguien tiene sugerencias para salvar este error
Gracias
Replies

jpgonzab

24/11/20 22:59
Martin, Para el error de compilación te recomiendo borrar el código generado para la app bajo mobile/Android y ejecutar un Rebuild del Main. Para el inconveniente al instalar la aplicación, debería bastar con desinstalarla del emulador y ejecutar nuevamente para que se reinstale. Saludos, On Tue, Nov 24, 2020 at 6:26 PM Martin Gaston

martin gaston

25/11/20 14:14
Funcionó bien Gracias El mar, 24 nov 2020 a las 19:59, Juan Pablo Gonzalez (< jpgonzalez@genexus.com>)


Back to sd